Reaction Details
TargetCannabinoid receptor 2
LigandBDBM50176947
Substrate/Competitorn/a
Meas. Tech.ChEMBL_430945 (CHEMBL914887)
Ki 420±n/a nM
Citation Brizzi, ABrizzi, VCascio, MGBisogno, TSirianni, RDi Marzo, V Design, synthesis, and binding studies of new potent ligands of cannabinoid receptors. J Med Chem48:7343-50 (2005) 
 
Cannabinoid receptor 2
Name:Cannabinoid receptor 2
Type:G Protein-Coupled Receptor (GPCR)
Mol. Mass.:39690.94
Organism:Homo sapiens (Human)
Description:P34972
Residue:360
BDBM50176947
NameBDBM50176947
Synonyms:11-(2-hexyl-5-hydroxyphenoxy)undecanoic acid (2-hydroxyethyl)amide | CHEMBL223990
TypeSmall organic molecule
Emp. Form.C25H43NO4
Mol. Mass.421.6132
SMILESCCCCCCc1ccc(O)cc1OCCCCCCCCCCC(=O)NCCO