Reaction Details
TargetCannabinoid receptor 1
LigandBDBM50176955
Substrate/Competitorn/a
Meas. Tech.ChEMBL_430944 (CHEMBL914886)
Ki>10000±n/a nM
Citation Brizzi, ABrizzi, VCascio, MGBisogno, TSirianni, RDi Marzo, V Design, synthesis, and binding studies of new potent ligands of cannabinoid receptors. J Med Chem48:7343-50 (2005) 
 
Cannabinoid receptor 1
Name:Cannabinoid receptor 1
Type:G Protein-Coupled Receptor (GPCR)
Mol. Mass.:52868.96
Organism:Homo sapiens (Human)
Description:P21554
Residue:472
BDBM50176955
NameBDBM50176955
Synonyms:16-(3-hydroxy-5-pentylphenoxy)hexadecanoic acid cyclopropylamide | CHEMBL223502
TypeSmall organic molecule
Emp. Form.C30H51NO3
Mol. Mass.473.7308
SMILESCCCCCc1cc(O)cc(OCCCCCCCCCCCCCCCC(=O)NC2CC2)c1