Reaction Details
TargetCannabinoid receptor 2
LigandBDBM50176964
Substrate/Competitorn/a
Meas. Tech.ChEMBL_430945 (CHEMBL914887)
Ki 3570±n/a nM
Citation Brizzi, ABrizzi, VCascio, MGBisogno, TSirianni, RDi Marzo, V Design, synthesis, and binding studies of new potent ligands of cannabinoid receptors. J Med Chem48:7343-50 (2005) 
 
Cannabinoid receptor 2
Name:Cannabinoid receptor 2
Type:G Protein-Coupled Receptor (GPCR)
Mol. Mass.:39690.94
Organism:Homo sapiens (Human)
Description:P34972
Residue:360
BDBM50176964
NameBDBM50176964
Synonyms:6-(2-hexyl-5-hydroxyphenoxy)hexanoic acid cyclopropylamide | CHEMBL224772
TypeSmall organic molecule
Emp. Form.C21H33NO3
Mol. Mass.347.4916
SMILESCCCCCCc1ccc(O)cc1OCCCCCC(=O)NC1CC1