Reaction Details
TargetCannabinoid receptor 1
LigandBDBM50176948
Substrate/Competitorn/a
Meas. Tech.ChEMBL_430944 (CHEMBL914886)
Ki 1300±n/a nM
Citation Brizzi, ABrizzi, VCascio, MGBisogno, TSirianni, RDi Marzo, V Design, synthesis, and binding studies of new potent ligands of cannabinoid receptors. J Med Chem48:7343-50 (2005) 
 
Cannabinoid receptor 1
Name:Cannabinoid receptor 1
Type:G Protein-Coupled Receptor (GPCR)
Mol. Mass.:52868.96
Organism:Homo sapiens (Human)
Description:P21554
Residue:472
BDBM50176948
NameBDBM50176948
Synonyms:6-(3-hydroxy-5-pentylphenoxy)hexanoic acid cyclopropylamide | CHEMBL224105
TypeSmall organic molecule
Emp. Form.C20H31NO3
Mol. Mass.333.465
SMILESCCCCCc1cc(O)cc(OCCCCCC(=O)NC2CC2)c1