Reaction Details
TargetCannabinoid receptor 2
LigandBDBM50176967
Substrate/Competitorn/a
Meas. Tech.ChEMBL_430945 (CHEMBL914887)
Ki 1400±n/a nM
Citation Brizzi, ABrizzi, VCascio, MGBisogno, TSirianni, RDi Marzo, V Design, synthesis, and binding studies of new potent ligands of cannabinoid receptors. J Med Chem48:7343-50 (2005) 
 
Cannabinoid receptor 2
Name:Cannabinoid receptor 2
Type:G Protein-Coupled Receptor (GPCR)
Mol. Mass.:39690.94
Organism:Homo sapiens (Human)
Description:P34972
Residue:360
BDBM50176967
NameBDBM50176967
Synonyms:11-(3-hydroxy-5-pentylphenoxy)undecanoic acid (4-hydroxyphenyl)amide | CHEMBL427100
TypeSmall organic molecule
Emp. Form.C28H41NO4
Mol. Mass.455.6294
SMILESCCCCCc1cc(O)cc(OCCCCCCCCCCC(=O)Nc2ccc(O)cc2)c1