Reaction Details
TargetCannabinoid receptor 2
LigandBDBM50176949
Substrate/Competitorn/a
Meas. Tech.ChEMBL_430945 (CHEMBL914887)
Ki 5400±n/a nM
Citation Brizzi, ABrizzi, VCascio, MGBisogno, TSirianni, RDi Marzo, V Design, synthesis, and binding studies of new potent ligands of cannabinoid receptors. J Med Chem48:7343-50 (2005) 
 
Cannabinoid receptor 2
Name:Cannabinoid receptor 2
Type:G Protein-Coupled Receptor (GPCR)
Mol. Mass.:39690.94
Organism:Homo sapiens (Human)
Description:P34972
Residue:360
BDBM50176949
NameBDBM50176949
Synonyms:11-(3-hydroxyphenoxy)undecanoic acid cyclopropilamide | CHEMBL225342
TypeSmall organic molecule
Emp. Form.C20H31NO3
Mol. Mass.333.465
SMILESOc1cccc(OCCCCCCCCCCC(=O)NC2CC2)c1