Reaction Details
TargetCannabinoid receptor 2
LigandBDBM50176954
Substrate/Competitorn/a
Meas. Tech.ChEMBL_430945 (CHEMBL914887)
Ki 30±n/a nM
Citation Brizzi, ABrizzi, VCascio, MGBisogno, TSirianni, RDi Marzo, V Design, synthesis, and binding studies of new potent ligands of cannabinoid receptors. J Med Chem48:7343-50 (2005) 
 
Cannabinoid receptor 2
Name:Cannabinoid receptor 2
Type:G Protein-Coupled Receptor (GPCR)
Mol. Mass.:39690.94
Organism:Homo sapiens (Human)
Description:P34972
Residue:360
BDBM50176954
NameBDBM50176954
Synonyms:11-(2-hexyl-5-hydroxyphenoxy)undecanoic acid cyclopropylamide | CHEMBL426923
TypeSmall organic molecule
Emp. Form.C26H43NO3
Mol. Mass.417.6245
SMILESCCCCCCc1ccc(O)cc1OCCCCCCCCCCC(=O)NC1CC1