Reaction Details
TargetCannabinoid receptor 2
LigandBDBM50176974
Substrate/Competitorn/a
Meas. Tech.ChEMBL_430945 (CHEMBL914887)
Ki>10000±n/a nM
Citation Brizzi, ABrizzi, VCascio, MGBisogno, TSirianni, RDi Marzo, V Design, synthesis, and binding studies of new potent ligands of cannabinoid receptors. J Med Chem48:7343-50 (2005) 
 
Cannabinoid receptor 2
Name:Cannabinoid receptor 2
Type:G Protein-Coupled Receptor (GPCR)
Mol. Mass.:39690.94
Organism:Homo sapiens (Human)
Description:P34972
Residue:360
BDBM50176974
NameBDBM50176974
Synonyms:6-(2-hexyl-5-hydroxyphenoxy)hexanoic acid (2-hydroxyethyl)amide | CHEMBL225020
TypeSmall organic molecule
Emp. Form.C20H33NO4
Mol. Mass.351.4803
SMILESCCCCCCc1ccc(O)cc1OCCCCCC(=O)NCCO