Reaction Details
TargetReceptor tyrosine-protein kinase erbB-2
LigandBDBM3032
Substrate/Competitorn/a
Meas. Tech.ChEMBL_431036 (CHEMBL916321)
IC50 143±n/a nM
Citation VanBrocklin, HFLim, JKCoffing, SLHom, DLNegash, KOno, MYGilmore, JLBryant, IRiese, DJ Anilinodialkoxyquinazolines: screening epidermal growth factor receptor tyrosine kinase inhibitors for potential tumor imaging probes. J Med Chem48:7445-56 (2005) 
 
Receptor tyrosine-protein kinase erbB-2
Name:Receptor tyrosine-protein kinase erbB-2
Type:n/a
Mol. Mass.:137894.47
Organism:Homo sapiens (Human)
Description:P04626
Residue:1255
BDBM3032
NameBDBM3032
Synonyms:CHEMBL1204168 N-(3-bromophenyl)-6,7-dimethoxyquinazolin-4-amine US11001595, Compound PD153035 US9422297, PD153035
TypeSmall organic molecule
Emp. Form.C16H14BrN3O2
Mol. Mass.360.205
SMILESCOc1cc2ncnc(Nc3cccc(Br)c3)c2cc1OC