Reaction Details
TargetCannabinoid receptor 1
LigandBDBM50177163
Substrate/Competitorn/a
Meas. Tech.ChEMBL_431069 (CHEMBL917774)
EC50 700±n/a nM
Citation Muccioli, GGWouters, JScriba, GKPoppitz, WPoupaert, JHLambert, DM 1-Benzhydryl-3-phenylurea and 1-benzhydryl-3-phenylthiourea derivatives: new templates among the CB1 cannabinoid receptor inverse agonists. J Med Chem48:7486-90 (2005) 
 
Cannabinoid receptor 1
Name:Cannabinoid receptor 1
Type:G Protein-Coupled Receptor (GPCR)
Mol. Mass.:52868.96
Organism:Homo sapiens (Human)
Description:P21554
Residue:472
BDBM50177163
NameBDBM50177163
Synonyms:1-(bis(4-chlorophenyl)methyl)-3-(4-bromophenyl)urea | CHEMBL436309
TypeSmall organic molecule
Emp. Form.C20H15BrCl2N2O
Mol. Mass.450.156
SMILESClc1ccc(cc1)C(NC(=O)Nc1ccc(Br)cc1)c1ccc(Cl)cc1