Reaction Details
TargetCannabinoid receptor 1
LigandBDBM50177162
Substrate/Competitorn/a
Meas. Tech.ChEMBL_431069 (CHEMBL917774)
EC50 450±n/a nM
Citation Muccioli, GGWouters, JScriba, GKPoppitz, WPoupaert, JHLambert, DM 1-Benzhydryl-3-phenylurea and 1-benzhydryl-3-phenylthiourea derivatives: new templates among the CB1 cannabinoid receptor inverse agonists. J Med Chem48:7486-90 (2005) 
 
Cannabinoid receptor 1
Name:Cannabinoid receptor 1
Type:G Protein-Coupled Receptor (GPCR)
Mol. Mass.:52868.96
Organism:Homo sapiens (Human)
Description:P21554
Residue:472
BDBM50177162
NameBDBM50177162
Synonyms:1-[bis(4-bromophenyl)methyl]-3-(4-chlorophenyl)-urea | CHEMBL224627
TypeSmall organic molecule
Emp. Form.C20H15Br2ClN2O
Mol. Mass.494.607
SMILESClc1ccc(NC(=O)NC(c2ccc(Br)cc2)c2ccc(Br)cc2)cc1