Reaction Details
TargetMetabotropic glutamate receptor 5
LigandBDBM50084137
Substrate/Competitorn/a
Meas. Tech.ChEMBL_432813 (CHEMBL914082)
Ki 20±n/a nM
Citation Hintermann, SVranesic, IAllgeier, HBrülisauer, AHoyer, DLemaire, MMoenius, TUrwyler, SWhitebread, SGasparini, FAuberson, YP ABP688, a novel selective and high affinity ligand for the labeling of mGlu5 receptors: identification, in vitro pharmacology, pharmacokinetic and biodistribution studies. Bioorg Med Chem15:903-14 (2006) 
 
Metabotropic glutamate receptor 5
Name:Metabotropic glutamate receptor 5
Type:Enzyme
Mol. Mass.:132484.72
Organism:Homo sapiens (Human)
Description:n/a
Residue:1212
BDBM50084137
NameBDBM50084137
Synonyms:2-Methyl-6-(phenylethynyl)pyridine 2-Methyl-6-phenylethynyl-pyridine(MPEP) 2-methyl-6-(phenyl-ethynyl)pyridine 6-methyl-2-(2-phenylethynyl)pyridine CHEMBL66654 US10618900, No. MPEP | [3H]-2-methyl-6-(phenylethynyl)-pyridine
TypeSmall organic molecule
Emp. Form.C14H11N
Mol. Mass.193.2438
SMILESCc1cccc(n1)C#Cc1ccccc1