Reaction Details
TargetMu-type opioid receptor
LigandBDBM50209670
Substrate/Competitorn/a
Meas. Tech.ChEMBL_434338 (CHEMBL919396)
EC50 4.4±n/a nM
Citation Peng, XKnapp, BIBidlack, JMNeumeyer, JL Pharmacological properties of bivalent ligands containing butorphan linked to nalbuphine, naltrexone, and naloxone at mu, delta, and kappa opioid receptors. J Med Chem50:2254-8 (2007) 
 
Mu-type opioid receptor
Name:Mu-type opioid receptor
Type:G Protein-Coupled Receptor (GPCR)
Mol. Mass.:44789.51
Organism:Homo sapiens (Human)
Description:P35372
Residue:400
BDBM50209670
NameBDBM50209670
Synonyms:17-(cyclopropylmethyl)morphinan-3-yl(5alpha)-17-(cyclopropylmethyl)-14-hydroxy-6-oxo-4,5-epoxymorphiana-3-yl sebacoylate | CHEMBL224014
TypeSmall organic molecule
Emp. Form.C51H66N2O7
Mol. Mass.819.0789
SMILESO[C@]12CCC(=O)[C@@H]3Oc4c5c(C[C@H]1N(CC1CC1)CC[C@@]235)ccc4OC(=O)CCCCCCCCC(=O)Oc1ccc2C[C@@H]3C4CCCC[C@]4(CCN3CC3CCC3)c2c1