Reaction Details
TargetMu-type opioid receptor
LigandBDBM50135808
Substrate/Competitorn/a
Meas. Tech.ChEMBL_434340 (CHEMBL919398)
Ki 0.230000±n/a nM
Citation Peng, XKnapp, BIBidlack, JMNeumeyer, JL Pharmacological properties of bivalent ligands containing butorphan linked to nalbuphine, naltrexone, and naloxone at mu, delta, and kappa opioid receptors. J Med Chem50:2254-8 (2007) 
 
Mu-type opioid receptor
Name:Mu-type opioid receptor
Type:G Protein-Coupled Receptor (GPCR)
Mol. Mass.:44789.51
Organism:Homo sapiens (Human)
Description:P35372
Residue:400
BDBM50135808
NameBDBM50135808
Synonyms:(-)-3-Hydroxy-N-cyclobutylmethylmorphinan S(+)-Mandelate 3-Hydroxy-N-cyclobutylmethylmorphinan CHEMBL301160 | MCL-101
TypeSmall organic molecule
Emp. Form.C21H29NO
Mol. Mass.311.4611
SMILESOc1ccc2C[C@@H]3[C@@H]4CCCC[C@]4(CCN3CC3CCC3)c2c1