Reaction Details
TargetHeme oxygenase 1
LigandBDBM50207200
Substrate/Competitorn/a
Meas. Tech.ChEMBL_435911 (CHEMBL905312)
IC50 1400±n/a nM
Citation Roman, GRiley, JGVlahakis, JZKinobe, RTBrien, JFNakatsu, KSzarek, WA Heme oxygenase inhibition by 2-oxy-substituted 1-(1H-imidazol-1-yl)-4-phenylbutanes: effect of halogen substitution in the phenyl ring. Bioorg Med Chem15:3225-34 (2007) 
 
Heme oxygenase 1
Name:Heme oxygenase 1
Type:Enzyme
Mol. Mass.:33005.15
Organism:Rattus norvegicus (rat)
Description:HO-1 obtained from rat spleen was used in enzyme assays.
Residue:289
BDBM50207200
NameBDBM50207200
Synonyms:4-(4-fluorophenyl)-1-(1H-imidazol-1-yl)-2-butanol hydrochloride | CHEMBL536518
TypeSmall organic molecule
Emp. Form.C13H15FN2O
Mol. Mass.234.2694
SMILESOC(CCc1ccc(F)cc1)Cn1ccnc1