Reaction Details
TargetHeme oxygenase 1
LigandBDBM84847
Substrate/Competitorn/a
Meas. Tech.ChEMBL_435911 (CHEMBL905312)
IC50 700±n/a nM
Citation Roman, GRiley, JGVlahakis, JZKinobe, RTBrien, JFNakatsu, KSzarek, WA Heme oxygenase inhibition by 2-oxy-substituted 1-(1H-imidazol-1-yl)-4-phenylbutanes: effect of halogen substitution in the phenyl ring. Bioorg Med Chem15:3225-34 (2007) 
 
Heme oxygenase 1
Name:Heme oxygenase 1
Type:Enzyme
Mol. Mass.:33005.15
Organism:Rattus norvegicus (rat)
Description:HO-1 obtained from rat spleen was used in enzyme assays.
Residue:289
BDBM84847
NameBDBM84847
Synonyms:1-azolyl-4-phenyl-2-butanone, 49a | CHEMBL558183
Typen/a
Emp. Form.C15H18N2O2
Mol. Mass.258.3156
SMILESC(CC1(Cn2ccnc2)OCCO1)c1ccccc1