Reaction Details
TargetSodium-dependent serotonin transporter
LigandBDBM50146518
Substrate/Competitorn/a
Meas. Tech.ChEMBL_436123 (CHEMBL905525)
Ki 1.70±n/a nM
Citation Andrés, JIAlcázar, JAlonso, JMAlvarez, RMBakker, MHBiesmans, ICid, JMDe Lucas, AIDrinkenburg, WFernández, JFont, LMIturrino, LLanglois, XLenaerts, IMartínez, SMegens, AAPastor, JPullan, SSteckler, T Tricyclic isoxazolines: identification of R226161 as a potential new antidepressant that combines potent serotonin reuptake inhibition and alpha2-adrenoceptor antagonism. Bioorg Med Chem15:3649-60 (2007) 
 
Sodium-dependent serotonin transporter
Name:Sodium-dependent serotonin transporter
Type:Multi-pass membrane protein
Mol. Mass.:70322.51
Organism:Homo sapiens (Human)
Description:P31645
Residue:630
BDBM50146518
NameBDBM50146518
Synonyms:(3R,3aS)-3-{4-[3-(4-Fluoro-phenyl)-2-methyl-allyl]-piperazin-1-ylmethyl}-7,8-dimethoxy-3a,4-dihydro-3H-chromeno[4,3-c]isoxazole R-226161 cis-(+/-)-7,8-dimethoxy-3-[4-(2-methyl-3-(4-fluoro)phenyl-2(E)-propen-1-yl)piperazin-1-ylmethyl]-3a,4-dihydro-3H-[1]benzopyrano[4,3-c]isoxazole | cis-(-)-7,8-dimethoxy-3-[4-(2-methyl-3-(4-fluoro)phenyl-2(E)-propen-1-yl)piperazin-1-ylmethyl]-3a,4-dihydro-3H-[1]benzopyrano[4,3-c]isoxazole
TypeSmall organic molecule
Emp. Form.C27H32FN3O4
Mol. Mass.481.5591
SMILESCOc1cc2OC[C@H]3[C@H](CN4CCN(C\C(C)=C\c5ccc(F)cc5)CC4)ON=C3c2cc1OC