Reaction Details
TargetEnoyl-acyl-carrier protein reductase
LigandBDBM50211890
Substrate/Competitorn/a
Meas. Tech.ChEMBL_436470 (CHEMBL904775)
Ki 7300±n/a nM
Citation Kumar, GParasuraman, PSharma, SKBanerjee, TKarmodiya, KSurolia, NSurolia, A Discovery of a rhodanine class of compounds as inhibitors of Plasmodium falciparum enoyl-acyl carrier protein reductase. J Med Chem50:2665-75 (2007) 
 
Enoyl-acyl-carrier protein reductase
Name:Enoyl-acyl-carrier protein reductase
Synonyms:n/a
Type:PROTEIN
Mol. Mass.:49770.86
Organism:Plasmodium falciparum
Description:ChEMBL_795989
Residue:432
BDBM50211890
NameBDBM50211890
TypeSmall organic molecule
Emp. Form.C23H31NO5S2
Mol. Mass.465.626
SMILESCCCCCCOc1ccc(\C=C2/SC(=S)N(CCCCCC(O)=O)C2=O)cc1OC