Reaction Details
TargetEnoyl-acyl-carrier protein reductase
LigandBDBM50211907
Substrate/Competitorn/a
Meas. Tech.ChEMBL_436470 (CHEMBL904775)
Ki 560±n/a nM
Citation Kumar, GParasuraman, PSharma, SKBanerjee, TKarmodiya, KSurolia, NSurolia, A Discovery of a rhodanine class of compounds as inhibitors of Plasmodium falciparum enoyl-acyl carrier protein reductase. J Med Chem50:2665-75 (2007) 
 
Enoyl-acyl-carrier protein reductase
Name:Enoyl-acyl-carrier protein reductase
Synonyms:n/a
Type:PROTEIN
Mol. Mass.:49770.86
Organism:Plasmodium falciparum
Description:ChEMBL_795989
Residue:432
BDBM50211907
NameBDBM50211907
TypeSmall organic molecule
Emp. Form.C14H7Cl2NO2S2
Mol. Mass.356.247
SMILESSC1=NC(=O)C(S1)=Cc1ccc(o1)-c1cccc(Cl)c1Cl