Reaction Details
TargetEnoyl-acyl-carrier protein reductase
LigandBDBM50211885
Substrate/Competitorn/a
Meas. Tech.ChEMBL_436469 (CHEMBL904776)
Ki 4.2±n/a nM
Citation Kumar, GParasuraman, PSharma, SKBanerjee, TKarmodiya, KSurolia, NSurolia, A Discovery of a rhodanine class of compounds as inhibitors of Plasmodium falciparum enoyl-acyl carrier protein reductase. J Med Chem50:2665-75 (2007) 
 
Enoyl-acyl-carrier protein reductase
Name:Enoyl-acyl-carrier protein reductase
Synonyms:n/a
Type:PROTEIN
Mol. Mass.:49770.86
Organism:Plasmodium falciparum
Description:ChEMBL_795989
Residue:432
BDBM50211885
NameBDBM50211885
TypeSmall organic molecule
Emp. Form.C16H11NO3S2
Mol. Mass.329.393
SMILESOc1ccc(\C=C2/SC(=S)N(C2=O)c2ccccc2)cc1O