Reaction Details
TargetEnoyl-acyl-carrier protein reductase
LigandBDBM50211901
Substrate/Competitorn/a
Meas. Tech.ChEMBL_436470 (CHEMBL904775)
Ki 5400±n/a nM
Citation Kumar, GParasuraman, PSharma, SKBanerjee, TKarmodiya, KSurolia, NSurolia, A Discovery of a rhodanine class of compounds as inhibitors of Plasmodium falciparum enoyl-acyl carrier protein reductase. J Med Chem50:2665-75 (2007) 
 
Enoyl-acyl-carrier protein reductase
Name:Enoyl-acyl-carrier protein reductase
Synonyms:n/a
Type:PROTEIN
Mol. Mass.:49770.86
Organism:Plasmodium falciparum
Description:ChEMBL_795989
Residue:432
BDBM50211901
NameBDBM50211901
TypeSmall organic molecule
Emp. Form.C24H24ClNO5S2
Mol. Mass.506.034
SMILESCOc1cc(\C=C2/SC(=S)N(CCCCCC(O)=O)C2=O)ccc1OCc1ccc(Cl)cc1