Reaction Details
TargetSodium-dependent dopamine transporter
LigandBDBM50212367
Substrate/Competitorn/a
Meas. Tech.ChEMBL_436641 (CHEMBL904951)
Ki 178±n/a nM
Citation Kim, DIDeutsch, HMYe, XSchweri, MM Synthesis and pharmacology of site-specific cocaine abuse treatment agents: restricted rotation analogues of methylphenidate. J Med Chem50:2718-31 (2007) 
 
Sodium-dependent dopamine transporter
Name:Sodium-dependent dopamine transporter
Type:Multi-pass membrane protein
Mol. Mass.:68749.45
Organism:Rattus norvegicus (rat)
Description:P23977
Residue:619
BDBM50212367
NameBDBM50212367
Synonyms:CHEMBL541895 | threo-1-aza-3alpha-methyl-5-phenyl[4.4.0]decane hydrochloride
TypeSmall organic molecule
Emp. Form.C16H23N
Mol. Mass.229.3605
SMILESC[C@H]1C[C@@H]([C@H]2CCCCN2C1)c1ccccc1