Reaction Details
TargetSodium-dependent dopamine transporter
LigandBDBM50212363
Substrate/Competitorn/a
Meas. Tech.ChEMBL_436641 (CHEMBL904951)
Ki 35±n/a nM
Citation Kim, DIDeutsch, HMYe, XSchweri, MM Synthesis and pharmacology of site-specific cocaine abuse treatment agents: restricted rotation analogues of methylphenidate. J Med Chem50:2718-31 (2007) 
 
Sodium-dependent dopamine transporter
Name:Sodium-dependent dopamine transporter
Type:Multi-pass membrane protein
Mol. Mass.:68749.45
Organism:Rattus norvegicus (rat)
Description:P23977
Residue:619
BDBM50212363
NameBDBM50212363
Synonyms:CHEMBL559186 | erythro-1-aza-5-(3,4-dichlorophenyl)[4.4.0]decane hydrochloride
TypeSmall organic molecule
Emp. Form.C15H19Cl2N
Mol. Mass.284.224
SMILESClc1ccc(cc1Cl)[C@@H]1CCCN2CCCC[C@H]12