Reaction Details
TargetTransporter
LigandBDBM50212365
Substrate/Competitorn/a
Meas. Tech.ChEMBL_436642 (CHEMBL904952)
Ki 28±n/a nM
Citation Kim, DIDeutsch, HMYe, XSchweri, MM Synthesis and pharmacology of site-specific cocaine abuse treatment agents: restricted rotation analogues of methylphenidate. J Med Chem50:2718-31 (2007) 
 
Transporter
Name:Transporter
Type:PROTEIN
Mol. Mass.:66787.87
Organism:Rattus norvegicus
Description:ChEMBL_1463061
Residue:597
BDBM50212365
NameBDBM50212365
Synonyms:CHEMBL556365 | threo-1-aza-5-(3,4-dichlorophenyl)[4.4.0]decane hydrochloride
TypeSmall organic molecule
Emp. Form.C15H19Cl2N
Mol. Mass.284.224
SMILESClc1ccc(cc1Cl)[C@H]1CCCN2CCCC[C@H]12