Reaction Details
TargetSodium-dependent serotonin transporter
LigandBDBM50212383
Substrate/Competitorn/a
Meas. Tech.ChEMBL_436643 (CHEMBL904953)
Ki 199±n/a nM
Citation Kim, DIDeutsch, HMYe, XSchweri, MM Synthesis and pharmacology of site-specific cocaine abuse treatment agents: restricted rotation analogues of methylphenidate. J Med Chem50:2718-31 (2007) 
 
Sodium-dependent serotonin transporter
Name:Sodium-dependent serotonin transporter
Type:Multi-pass membrane protein
Mol. Mass.:70168.43
Organism:Rattus norvegicus (rat)
Description:P31652
Residue:630
BDBM50212383
NameBDBM50212383
Synonyms:(1R,2S,9aR)-1-(3,4-dichlorophenyl)-2-ethyl-octahydro-1H-quinolizine hydrochloride | CHEMBL534501
TypeSmall organic molecule
Emp. Form.C17H23Cl2N
Mol. Mass.312.277
SMILESCC[C@H]1CCN2CCCC[C@@H]2[C@H]1c1ccc(Cl)c(Cl)c1