Reaction Details
TargetSodium-dependent dopamine transporter
LigandBDBM50212381
Substrate/Competitorn/a
Meas. Tech.ChEMBL_436641 (CHEMBL904951)
Ki 11±n/a nM
Citation Kim, DIDeutsch, HMYe, XSchweri, MM Synthesis and pharmacology of site-specific cocaine abuse treatment agents: restricted rotation analogues of methylphenidate. J Med Chem50:2718-31 (2007) 
 
Sodium-dependent dopamine transporter
Name:Sodium-dependent dopamine transporter
Type:Multi-pass membrane protein
Mol. Mass.:68749.45
Organism:Rattus norvegicus (rat)
Description:P23977
Residue:619
BDBM50212381
NameBDBM50212381
Synonyms:CHEMBL537874 | threo-1-aza-4beta-methoxy-5-phenyl[4.4.0]decane hydrochloride
TypeSmall organic molecule
Emp. Form.C16H23NO
Mol. Mass.245.3599
SMILESCO[C@H]1CCN2CCCC[C@@H]2[C@H]1c1ccccc1