Reaction Details
TargetSodium-dependent serotonin transporter
LigandBDBM50212359
Substrate/Competitorn/a
Meas. Tech.ChEMBL_436643 (CHEMBL904953)
Ki 168±n/a nM
Citation Kim, DIDeutsch, HMYe, XSchweri, MM Synthesis and pharmacology of site-specific cocaine abuse treatment agents: restricted rotation analogues of methylphenidate. J Med Chem50:2718-31 (2007) 
 
Sodium-dependent serotonin transporter
Name:Sodium-dependent serotonin transporter
Type:Multi-pass membrane protein
Mol. Mass.:70168.43
Organism:Rattus norvegicus (rat)
Description:P31652
Residue:630
BDBM50212359
NameBDBM50212359
Synonyms:CHEMBL558182 | threo-1-aza-4beta-hydroxy-5-(3,4-dichlorophenyl)[4.4.0]decane hydrochloride
TypeSmall organic molecule
Emp. Form.C15H19Cl2NO
Mol. Mass.300.223
SMILESO[C@H]1CCN2CCCC[C@@H]2[C@H]1c1ccc(Cl)c(Cl)c1