Reaction Details
TargetTyrosine-protein phosphatase non-receptor type 1
LigandBDBM50212392
Substrate/Competitorn/a
Meas. Tech.ChEMBL_436656 (CHEMBL904966)
IC50 14400±n/a nM
Citation Cui, LNdinteh, DTNa, MThuong, PTSilike-Muruumu, JNjamen, DMbafor, JTFomum, ZTAhn, JSOh, WK Isoprenylated flavonoids from the stem bark of Erythrina abyssinica. J Nat Prod70:1039-42 (2007) 
 
Tyrosine-protein phosphatase non-receptor type 1
Name:Tyrosine-protein phosphatase non-receptor type 1
Type:Protein phosphatase
Mol. Mass.:49963.76
Organism:Homo sapiens (Human)
Description:Human recombinant GST-fusion PTP1B (1-435).
Residue:435
BDBM50212392
NameBDBM50212392
Synonyms:CHEMBL229506 | sigmoidin A
TypeSmall organic molecule
Emp. Form.C25H28O6
Mol. Mass.424.4862
SMILES[#6]\[#6](-[#6])=[#6]\[#6]-c1cc(-[#6@@H]-2-[#6]-[#6](=O)-c3c(-[#8])cc(-[#8])cc3-[#8]-2)c(-[#6]\[#6]=[#6](\[#6])-[#6])c(-[#8])c1-[#8]