Reaction Details
TargetTyrosine-protein phosphatase non-receptor type 1
LigandBDBM50212396
Substrate/Competitorn/a
Meas. Tech.ChEMBL_436656 (CHEMBL904966)
IC50>60000±n/a nM
Citation Cui, LNdinteh, DTNa, MThuong, PTSilike-Muruumu, JNjamen, DMbafor, JTFomum, ZTAhn, JSOh, WK Isoprenylated flavonoids from the stem bark of Erythrina abyssinica. J Nat Prod70:1039-42 (2007) 
 
Tyrosine-protein phosphatase non-receptor type 1
Name:Tyrosine-protein phosphatase non-receptor type 1
Type:Protein phosphatase
Mol. Mass.:49963.76
Organism:Homo sapiens (Human)
Description:Human recombinant GST-fusion PTP1B (1-435).
Residue:435
BDBM50212396
NameBDBM50212396
Synonyms:CHEMBL229617 | sigmoidin C
TypeSmall organic molecule
Emp. Form.C20H18O6
Mol. Mass.354.3533
SMILESCC1(C)Oc2c(O)cc(cc2C=C1)[C@@H]1CC(=O)c2c(O)cc(O)cc2O1