Reaction Details
TargetTyrosine-protein phosphatase non-receptor type 1
LigandBDBM50212399
Substrate/Competitorn/a
Meas. Tech.ChEMBL_436656 (CHEMBL904966)
IC50 19400±n/a nM
Citation Cui, LNdinteh, DTNa, MThuong, PTSilike-Muruumu, JNjamen, DMbafor, JTFomum, ZTAhn, JSOh, WK Isoprenylated flavonoids from the stem bark of Erythrina abyssinica. J Nat Prod70:1039-42 (2007) 
 
Tyrosine-protein phosphatase non-receptor type 1
Name:Tyrosine-protein phosphatase non-receptor type 1
Type:Protein phosphatase
Mol. Mass.:49963.76
Organism:Homo sapiens (Human)
Description:Human recombinant GST-fusion PTP1B (1-435).
Residue:435
BDBM50212399
NameBDBM50212399
Synonyms:CHEMBL229454 | sigmoidin B
TypeSmall organic molecule
Emp. Form.C20H20O6
Mol. Mass.356.3692
SMILES[#6]\[#6](-[#6])=[#6]\[#6]-c1cc(cc(-[#8])c1-[#8])-[#6@@H]-1-[#6]-[#6](=O)-c2c(-[#8])cc(-[#8])cc2-[#8]-1