Reaction Details
TargetPotassium voltage-gated channel subfamily A member 5
LigandBDBM50213095
Substrate/Competitorn/a
Meas. Tech.ChEMBL_436809 (CHEMBL905111)
IC50 7700±n/a nM
Citation Plouvier, BBeatch, GNJung, GLZolotoy, ASheng, TClohs, LBarrett, TDFedida, DWang, WQZhu, JJLiu, YAbraham, SLynn, LDong, YWall, RAWalker, MJ Synthesis and biological studies of novel 2-aminoalkylethers as potential antiarrhythmic agents for the conversion of atrial fibrillation. J Med Chem50:2818-41 (2007) 
 
Potassium voltage-gated channel subfamily A member 5
Name:Potassium voltage-gated channel subfamily A member 5
Type:Enzyme
Mol. Mass.:67222.47
Organism:Homo sapiens (Human)
Description:P22460
Residue:613
BDBM50213095
NameBDBM50213095
Synonyms:(1S,2S)-1-(1-Naphthalenethoxy)-2-(3-ketopyrrolidinyl)cyclohexane | CHEMBL375475
TypeSmall organic molecule
Emp. Form.C22H27NO2
Mol. Mass.337.4553
SMILESO=C1CCN(C1)[C@H]1CCCC[C@@H]1OCCc1cccc2ccccc12