Reaction Details
TargetPotassium voltage-gated channel subfamily B member 1
LigandBDBM50213093
Substrate/Competitorn/a
Meas. Tech.ChEMBL_436811 (CHEMBL905113)
IC50 6000±n/a nM
Citation Plouvier, BBeatch, GNJung, GLZolotoy, ASheng, TClohs, LBarrett, TDFedida, DWang, WQZhu, JJLiu, YAbraham, SLynn, LDong, YWall, RAWalker, MJ Synthesis and biological studies of novel 2-aminoalkylethers as potential antiarrhythmic agents for the conversion of atrial fibrillation. J Med Chem50:2818-41 (2007) 
 
Potassium voltage-gated channel subfamily B member 1
Name:Potassium voltage-gated channel subfamily B member 1
Type:PROTEIN
Mol. Mass.:95652.47
Organism:Rattus norvegicus
Description:ChEMBL_436811
Residue:857
BDBM50213093
NameBDBM50213093
Synonyms:(1R,2R)-1-(1-naphthalenethoxy)-2-(3-ketopyrrolidinyl)cyclohexane | CHEMBL229125
TypeSmall organic molecule
Emp. Form.C22H27NO2
Mol. Mass.337.4553
SMILESO=C1CCN(C1)[C@@H]1CCCC[C@H]1OCCc1cccc2ccccc12