Reaction Details
TargetCannabinoid receptor 1
LigandBDBM50215228
Substrate/Competitorn/a
Meas. Tech.ChEMBL_437161 (CHEMBL906558)
Ki 190±n/a nM
Citation Brizzi, ACascio, MGBrizzi, VBisogno, TDinatolo, MTMartinelli, ATuccinardi, TDi Marzo, V Design, synthesis, binding, and molecular modeling studies of new potent ligands of cannabinoid receptors. Bioorg Med Chem15:5406-16 (2007) 
 
Cannabinoid receptor 1
Name:Cannabinoid receptor 1
Type:G Protein-Coupled Receptor (GPCR)
Mol. Mass.:52868.96
Organism:Homo sapiens (Human)
Description:P21554
Residue:472
BDBM50215228
NameBDBM50215228
Synonyms:8-(4-hexyl-3-hydroxy-phenoxy)-octanoic acid (2-hydroxy-ethyl)-amide | CHEMBL228509
TypeSmall organic molecule
Emp. Form.C22H37NO4
Mol. Mass.379.5335
SMILESCCCCCCc1ccc(OCCCCCCCC(=O)NCCO)cc1O