Reaction Details
TargetCannabinoid receptor 2
LigandBDBM50215227
Substrate/Competitorn/a
Meas. Tech.ChEMBL_437162 (CHEMBL906559)
Ki 470±n/a nM
Citation Brizzi, ACascio, MGBrizzi, VBisogno, TDinatolo, MTMartinelli, ATuccinardi, TDi Marzo, V Design, synthesis, binding, and molecular modeling studies of new potent ligands of cannabinoid receptors. Bioorg Med Chem15:5406-16 (2007) 
 
Cannabinoid receptor 2
Name:Cannabinoid receptor 2
Type:G Protein-Coupled Receptor (GPCR)
Mol. Mass.:39690.94
Organism:Homo sapiens (Human)
Description:P34972
Residue:360
BDBM50215227
NameBDBM50215227
Synonyms:11-(2-hexyl-5-hydroxy-phenoxy)-undecanoic acidcyclopropylmethyl-amide | CHEMBL228457
TypeSmall organic molecule
Emp. Form.C27H45NO3
Mol. Mass.431.6511
SMILESCCCCCCc1c(O)cccc1OCCCCCCCCCCC(=O)NCC1CC1