Reaction Details
TargetCannabinoid receptor 1
LigandBDBM50215234
Substrate/Competitorn/a
Meas. Tech.ChEMBL_437161 (CHEMBL906558)
Ki 310±n/a nM
Citation Brizzi, ACascio, MGBrizzi, VBisogno, TDinatolo, MTMartinelli, ATuccinardi, TDi Marzo, V Design, synthesis, binding, and molecular modeling studies of new potent ligands of cannabinoid receptors. Bioorg Med Chem15:5406-16 (2007) 
 
Cannabinoid receptor 1
Name:Cannabinoid receptor 1
Type:G Protein-Coupled Receptor (GPCR)
Mol. Mass.:52868.96
Organism:Homo sapiens (Human)
Description:P21554
Residue:472
BDBM50215234
NameBDBM50215234
Synonyms:8-(2-hexyl-5-hydroxy-phenoxy)-octanoic acidcyclopropylamide | CHEMBL228456
TypeSmall organic molecule
Emp. Form.C23H37NO3
Mol. Mass.375.5448
SMILESCCCCCCc1c(O)cccc1OCCCCCCCC(=O)NC1CC1