Reaction Details
TargetFatty-acid amide hydrolase 1 [30-579]
LigandBDBM50215240
Substrate/Competitorn/a
Meas. Tech.ChEMBL_437163 (CHEMBL906560)
IC50>50000±n/a nM
Citation Brizzi, ACascio, MGBrizzi, VBisogno, TDinatolo, MTMartinelli, ATuccinardi, TDi Marzo, V Design, synthesis, binding, and molecular modeling studies of new potent ligands of cannabinoid receptors. Bioorg Med Chem15:5406-16 (2007) 
 
Fatty-acid amide hydrolase 1 [30-579]
Name:Fatty-acid amide hydrolase 1 [30-579]
Type:Single-pass membrane protein; homodimer
Mol. Mass.:60474.00
Organism:Rattus norvegicus (rat)
Description:P97612 (aa 30-579)
Residue:550
BDBM50215240
NameBDBM50215240
Synonyms:8-(3-hydroxy-5-pentyl-phenoxy)-octanoic acid cyclopropylamide | CHEMBL228347
TypeSmall organic molecule
Emp. Form.C22H35NO3
Mol. Mass.361.5182
SMILESCCCCCc1cc(O)cc(OCCCCCCCC(=O)NC2CC2)c1