Reaction Details
TargetCannabinoid receptor 1
LigandBDBM50215242
Substrate/Competitorn/a
Meas. Tech.ChEMBL_437161 (CHEMBL906558)
Ki 510±n/a nM
Citation Brizzi, ACascio, MGBrizzi, VBisogno, TDinatolo, MTMartinelli, ATuccinardi, TDi Marzo, V Design, synthesis, binding, and molecular modeling studies of new potent ligands of cannabinoid receptors. Bioorg Med Chem15:5406-16 (2007) 
 
Cannabinoid receptor 1
Name:Cannabinoid receptor 1
Type:G Protein-Coupled Receptor (GPCR)
Mol. Mass.:52868.96
Organism:Homo sapiens (Human)
Description:P21554
Residue:472
BDBM50215242
NameBDBM50215242
Synonyms:11-(3-hydroxy-5-pentyl-phenoxy)-undecanoic acid cyclopropylmethyl-amide | CHEMBL228348
TypeSmall organic molecule
Emp. Form.C26H43NO3
Mol. Mass.417.6245
SMILESCCCCCc1cc(O)cc(OCCCCCCCCCCC(=O)NCC2CC2)c1