Reaction Details
TargetFatty-acid amide hydrolase 1 [30-579]
LigandBDBM50215225
Substrate/Competitorn/a
Meas. Tech.ChEMBL_437163 (CHEMBL906560)
IC50>50000±n/a nM
Citation Brizzi, ACascio, MGBrizzi, VBisogno, TDinatolo, MTMartinelli, ATuccinardi, TDi Marzo, V Design, synthesis, binding, and molecular modeling studies of new potent ligands of cannabinoid receptors. Bioorg Med Chem15:5406-16 (2007) 
 
Fatty-acid amide hydrolase 1 [30-579]
Name:Fatty-acid amide hydrolase 1 [30-579]
Type:Single-pass membrane protein; homodimer
Mol. Mass.:60474.00
Organism:Rattus norvegicus (rat)
Description:P97612 (aa 30-579)
Residue:550
BDBM50215225
NameBDBM50215225
Synonyms:12-(4-hexyl-3-hydroxy-phenoxy)-dodecanoic acidcyclopropylamide | CHEMBL229821
TypeSmall organic molecule
Emp. Form.C27H45NO3
Mol. Mass.431.6511
SMILESCCCCCCc1ccc(OCCCCCCCCCCCC(=O)NC2CC2)cc1O