Reaction Details
TargetCannabinoid receptor 1
LigandBDBM50215244
Substrate/Competitorn/a
Meas. Tech.ChEMBL_437161 (CHEMBL906558)
Ki 2100±n/a nM
Citation Brizzi, ACascio, MGBrizzi, VBisogno, TDinatolo, MTMartinelli, ATuccinardi, TDi Marzo, V Design, synthesis, binding, and molecular modeling studies of new potent ligands of cannabinoid receptors. Bioorg Med Chem15:5406-16 (2007) 
 
Cannabinoid receptor 1
Name:Cannabinoid receptor 1
Type:G Protein-Coupled Receptor (GPCR)
Mol. Mass.:52868.96
Organism:Homo sapiens (Human)
Description:P21554
Residue:472
BDBM50215244
NameBDBM50215244
Synonyms:11-(2-hexyl-5-hydroxy-phenoxy)-undecanoic acid[2-(3,4-dihydroxy-phenyl)-ethyl]-amide | CHEMBL228507
TypeSmall organic molecule
Emp. Form.C31H47NO5
Mol. Mass.513.7086
SMILESCCCCCCc1c(O)cccc1OCCCCCCCCCCC(=O)NCCc1ccc(O)c(O)c1