Reaction Details
TargetLeucine--tRNA ligase, cytoplasmic
LigandBDBM50370987
Substrate/Competitorn/a
Meas. Tech.ChEMBL_437217 (CHEMBL906615)
Ki 31400±n/a nM
Citation Rock, FLMao, WYaremchuk, ATukalo, MCrépin, TZhou, HZhang, YKHernandez, VAkama, TBaker, SJPlattner, JJShapiro, LMartinis, SABenkovic, SJCusack, SAlley, MR An antifungal agent inhibits an aminoacyl-tRNA synthetase by trapping tRNA in the editing site. Science316:1759-1761 (2007) 
 
Leucine--tRNA ligase, cytoplasmic
Name:Leucine--tRNA ligase, cytoplasmic
Type:PROTEIN
Mol. Mass.:124127.98
Organism:Saccharomyces cerevisiae S288c
Description:ChEMBL_437218
Residue:1090
BDBM50370987
NameBDBM50370987
Synonyms:TAVABOROLE
TypeSmall organic molecule
Emp. Form.C7H6BFO2
Mol. Mass.151.931
SMILESOB1OCc2cc(F)ccc12