Reaction Details
TargetAmine oxidase [flavin-containing] B
LigandBDBM50217373
Substrate/Competitorn/a
Meas. Tech.ChEMBL_437311 (CHEMBL906711)
IC50 22130±n/a nM
Citation Gökhan-Kelekçi, NYabanoglu, SKüpeli, ESalgin, UOzgen, OUçar, GYesilada, EKendi, EYesilada, ABilgin, AA A new therapeutic approach in Alzheimer disease: some novel pyrazole derivatives as dual MAO-B inhibitors and antiinflammatory analgesics. Bioorg Med Chem15:5775-86 (2007) 
 
Amine oxidase [flavin-containing] B
Name:Amine oxidase [flavin-containing] B
Type:Enzyme
Mol. Mass.:58469.65
Organism:Rattus norvegicus (rat)
Description:P19643
Residue:520
BDBM50217373
NameBDBM50217373
Synonyms:CHEMBL229550 | N-ethyl-3-(4-methoxyphenyl)-5-(1H-pyrrol-2-yl)-4,5-dihydropyrazole-1-carbothioamide
TypeSmall organic molecule
Emp. Form.C17H20N4OS
Mol. Mass.328.432
SMILESCCNC(=S)N1N=C(CC1c1ccc[nH]1)c1ccc(OC)cc1