Reaction Details
TargetProto-oncogene tyrosine-protein kinase Src
LigandBDBM50198795
Substrate/Competitorn/a
Meas. Tech.ChEMBL_437736 (CHEMBL905921)
IC50 40±n/a nM
Citation Noronha, GBarrett, KBoccia, ABrodhag, TCao, JChow, CPDneprovskaia, EDoukas, JFine, RGong, XGritzen, CGu, HHanna, EHood, JDHu, SKang, XKey, JKlebansky, BKousba, ALi, GLohse, DMak, CCMcPherson, APalanki, MSPathak, VPRenick, JShi, FSoll, RSplittgerber, UStoughton, STang, SYee, SZeng, BZhao, NZhu, H Discovery of [7-(2,6-dichlorophenyl)-5-methylbenzo [1,2,4]triazin-3-yl]-[4-(2-pyrrolidin-1-ylethoxy)phenyl]amine--a potent, orally active Src kinase inhibitor with anti-tumor activity in preclinical assays. Bioorg Med Chem Lett17:602-8 (2007) 
 
Proto-oncogene tyrosine-protein kinase Src
Name:Proto-oncogene tyrosine-protein kinase Src
Type:Protein
Mol. Mass.:59838.60
Organism:Homo sapiens (Human)
Description:P12931
Residue:536
BDBM50198795
NameBDBM50198795
Synonyms:7-(2,6-dimethylphenyl)-5-methyl-N-(3-(2-(4-methylpiperazin-1-yl)ethoxy)phenyl)benzo[e][1,2,4]triazin-3-amine US8481536, 379 | US8481536, 580
TypeSmall organic molecule
Emp. Form.C29H34N6O
Mol. Mass.482.6199
SMILESCN1CCN(CCOc2cccc(Nc3nnc4cc(cc(C)c4n3)-c3c(C)cccc3C)c2)CC1