Reaction Details
TargetCytochrome P450 2C19
LigandBDBM50198782
Substrate/Competitorn/a
Meas. Tech.ChEMBL_437778 (CHEMBL905867)
IC50 12000±n/a nM
Citation Noronha, GBarrett, KBoccia, ABrodhag, TCao, JChow, CPDneprovskaia, EDoukas, JFine, RGong, XGritzen, CGu, HHanna, EHood, JDHu, SKang, XKey, JKlebansky, BKousba, ALi, GLohse, DMak, CCMcPherson, APalanki, MSPathak, VPRenick, JShi, FSoll, RSplittgerber, UStoughton, STang, SYee, SZeng, BZhao, NZhu, H Discovery of [7-(2,6-dichlorophenyl)-5-methylbenzo [1,2,4]triazin-3-yl]-[4-(2-pyrrolidin-1-ylethoxy)phenyl]amine--a potent, orally active Src kinase inhibitor with anti-tumor activity in preclinical assays. Bioorg Med Chem Lett17:602-8 (2007) 
 
Cytochrome P450 2C19
Name:Cytochrome P450 2C19
Type:Enzyme
Mol. Mass.:55935.47
Organism:Homo sapiens (Human)
Description:P33261
Residue:490
BDBM50198782
NameBDBM50198782
Synonyms:([7-(2,6-dichloro-phenyl)-5-methyl-benzo[1,2,4]triazin-3-yl]-[4-(2-pyrrolidin-1-yl-ethoxy)-phenyl]-amine) 7-(2,6-dichlorophenyl)-5-methyl-N-[4-(2-pyrrolidin-1-ylethoxy)-phenyl]-1,2,4-benzotriazin-3-amine TG-100435 US8481536, 575
TypeSmall organic molecule
Emp. Form.C26H25Cl2N5O
Mol. Mass.494.416
SMILESCc1cc(cc2nnc(Nc3ccc(OCCN4CCCC4)cc3)nc12)-c1c(Cl)cccc1Cl