Reaction Details
TargetProto-oncogene tyrosine-protein kinase Src
LigandBDBM50198827
Substrate/Competitorn/a
Meas. Tech.ChEMBL_437736 (CHEMBL905921)
IC50 10±n/a nM
Citation Noronha, GBarrett, KBoccia, ABrodhag, TCao, JChow, CPDneprovskaia, EDoukas, JFine, RGong, XGritzen, CGu, HHanna, EHood, JDHu, SKang, XKey, JKlebansky, BKousba, ALi, GLohse, DMak, CCMcPherson, APalanki, MSPathak, VPRenick, JShi, FSoll, RSplittgerber, UStoughton, STang, SYee, SZeng, BZhao, NZhu, H Discovery of [7-(2,6-dichlorophenyl)-5-methylbenzo [1,2,4]triazin-3-yl]-[4-(2-pyrrolidin-1-ylethoxy)phenyl]amine--a potent, orally active Src kinase inhibitor with anti-tumor activity in preclinical assays. Bioorg Med Chem Lett17:602-8 (2007) 
 
Proto-oncogene tyrosine-protein kinase Src
Name:Proto-oncogene tyrosine-protein kinase Src
Type:Protein
Mol. Mass.:59838.60
Organism:Homo sapiens (Human)
Description:P12931
Residue:536
BDBM50198827
NameBDBM50198827
Synonyms:7-(2,6-dimethylphenyl)-N5-methyl-N3-(4-(2-(pyrrolidin-1-yl)ethoxy)phenyl)benzo[e][1,2,4]triazine-3,5-diamine US8481536, 503
TypeSmall organic molecule
Emp. Form.C28H32N6O
Mol. Mass.468.5933
SMILESCNc1cc(cc2nnc(Nc3ccc(OCCN4CCCC4)cc3)nc12)-c1c(C)cccc1C