Reaction Details
TargetDelta-type opioid receptor
LigandBDBM50204452
Substrate/Competitorn/a
Meas. Tech.ChEMBL_438284 (CHEMBL887390)
Ki 15±n/a nM
Citation Peng, XKnapp, BIBidlack, JMNeumeyer, JL High-affinity carbamate analogues of morphinan at opioid receptors. Bioorg Med Chem Lett17:1508-11 (2007) 
 
Delta-type opioid receptor
Name:Delta-type opioid receptor
Type:G Protein-Coupled Receptor (GPCR)
Mol. Mass.:40382.98
Organism:Homo sapiens (Human)
Description:Competition binding assays were carried out using membrane preparations from transfected HN9.10 cells that constitutively expressed the delta opioid receptor.
Residue:372
BDBM50204452
NameBDBM50204452
Synonyms:CHEMBL394624 | MCL-443
TypeSmall organic molecule
Emp. Form.C29H36N2O2
Mol. Mass.444.6083
SMILESO=C(NCc1ccccc1)Oc1ccc2CC3C4CCCCC4(CCN3CC3CCC3)c2c1