Reaction Details
TargetMu-type opioid receptor
LigandBDBM50204453
Substrate/Competitorn/a
Meas. Tech.ChEMBL_438291 (CHEMBL887397)
IC50 16±n/a nM
Citation Peng, XKnapp, BIBidlack, JMNeumeyer, JL High-affinity carbamate analogues of morphinan at opioid receptors. Bioorg Med Chem Lett17:1508-11 (2007) 
 
Mu-type opioid receptor
Name:Mu-type opioid receptor
Type:G Protein-Coupled Receptor (GPCR)
Mol. Mass.:44789.51
Organism:Homo sapiens (Human)
Description:P35372
Residue:400
BDBM50204453
NameBDBM50204453
Synonyms:CHEMBL263096 | MCL-444
TypeSmall organic molecule
Emp. Form.C28H34N2O2
Mol. Mass.430.5818
SMILESO=C(NCc1ccccc1)Oc1ccc2CC3C4CCCCC4(CCN3CC3CC3)c2c1