Reaction Details
TargetKappa-type opioid receptor
LigandBDBM50204458
Substrate/Competitorn/a
Meas. Tech.ChEMBL_438283 (CHEMBL887389)
Ki 3.3±n/a nM
Citation Peng, XKnapp, BIBidlack, JMNeumeyer, JL High-affinity carbamate analogues of morphinan at opioid receptors. Bioorg Med Chem Lett17:1508-11 (2007) 
 
Kappa-type opioid receptor
Name:Kappa-type opioid receptor
Type:G Protein-Coupled Receptor (GPCR)
Mol. Mass.:42648.76
Organism:Homo sapiens (Human)
Description:P41145
Residue:380
BDBM50204458
NameBDBM50204458
Synonyms:CHEMBL245049 | MCL-433
TypeSmall organic molecule
Emp. Form.C19H26N2O2
Mol. Mass.314.4219
SMILESCNC(=O)Oc1ccc2CC3C4CCCCC4(CCN3C)c2c1