Reaction Details
TargetKappa-type opioid receptor
LigandBDBM50204456
Substrate/Competitorn/a
Meas. Tech.ChEMBL_438283 (CHEMBL887389)
Ki 3.4±n/a nM
Citation Peng, XKnapp, BIBidlack, JMNeumeyer, JL High-affinity carbamate analogues of morphinan at opioid receptors. Bioorg Med Chem Lett17:1508-11 (2007) 
 
Kappa-type opioid receptor
Name:Kappa-type opioid receptor
Type:G Protein-Coupled Receptor (GPCR)
Mol. Mass.:42648.76
Organism:Homo sapiens (Human)
Description:P41145
Residue:380
BDBM50204456
NameBDBM50204456
Synonyms:CHEMBL241824 | MCL-434
TypeSmall organic molecule
Emp. Form.C22H30N2O2
Mol. Mass.354.4858
SMILESCNC(=O)Oc1ccc2CC3C4CCCCC4(CCN3CC3CC3)c2c1