Reaction Details
TargetVascular endothelial growth factor receptor 2
LigandBDBM4864
Substrate/Competitorn/a
Meas. Tech.ChEMBL_438434 (CHEMBL887535)
IC50 1700±n/a nM
Citation Yu, HWang, ZZhang, LZhang, JHuang, Q Pharmacophore modeling and in silico screening for new KDR kinase inhibitors. Bioorg Med Chem Lett17:2126-33 (2007) 
 
Vascular endothelial growth factor receptor 2
Name:Vascular endothelial growth factor receptor 2
Type:Receptor Tyrosine Kinase
Mol. Mass.:151510.97
Organism:Homo sapiens (Human)
Description:P35968
Residue:1356
BDBM4864
NameBDBM4864
Synonyms:8-(4-Chloroanilino)-5-(4-pyridylmethyl)pyrido[2,3-d]-pyridazine CHEMBL306284 | N-(4-chlorophenyl)-5-(pyridin-4-ylmethyl)pyrido[2,3-d]pyridazin-8-amine
TypeSmall organic molecule
Emp. Form.C19H14ClN5
Mol. Mass.347.801
SMILESClc1ccc(Nc2nnc(Cc3ccncc3)c3cccnc23)cc1