Reaction Details
TargetDelta-type opioid receptor
LigandBDBM50210394
Substrate/Competitorn/a
Meas. Tech.ChEMBL_438624 (CHEMBL888955)
Ki 1977±n/a nM
Citation Ho, GDBercovici, ATulshian, DGreenlee, WJFawzi, ASmith Torhan, AZhang, H Synthesis and structure-activity relationships of 4-hydroxy-4-phenylpiperidines as nociceptin receptor ligands: Part 1. Bioorg Med Chem Lett17:3023-7 (2007) 
 
Delta-type opioid receptor
Name:Delta-type opioid receptor
Type:G Protein-Coupled Receptor (GPCR)
Mol. Mass.:40382.98
Organism:Homo sapiens (Human)
Description:Competition binding assays were carried out using membrane preparations from transfected HN9.10 cells that constitutively expressed the delta opioid receptor.
Residue:372
BDBM50210394
NameBDBM50210394
Synonyms:1-((2-(hydroxymethyl)phenyl)(phenyl)methyl)-4-phenylpiperidin-4-ol | CHEMBL228858
TypeSmall organic molecule
Emp. Form.C25H27NO2
Mol. Mass.373.4874
SMILESOCc1ccccc1C(N1CCC(O)(CC1)c1ccccc1)c1ccccc1